Target
Carboxypeptidase B2
Ligand
BDBM50395734
Substrate
Meas. Tech.
ChEMBL_860204 (CHEMBL2168944)
IC50
4.1±n/a nM
Citation
 Yoshimoto, NSasaki, TSugimoto, KIshii, HYamamoto, K Design and characterization of a selenium-containing inhibitor of activated thrombin-activatable fibrinolysis inhibitor (TAFIa), a zinc-containing metalloprotease. J Med Chem 55:7696-705 (2012)  
Target
Name:
Carboxypeptidase B2
Synonyms:
CBPB2_HUMAN CPU Carboxypeptidase B2 isoform A Plasma carboxypeptidase B Thrombin-activable fibrinolysis inhibitor | pCPB
Type:
Enzyme
Mol. Mass.:
48432.74
Organism:
Homo sapiens (Human)
Description:
Q96IY4
Residue:
423
  
Inhibitor
Name:
BDBM50395734
Synonyms:
CHEMBL2164460
Type:
Small organic molecule
Emp. Form.:
C18H27NO3Se
Mol. Mass.:
384.37
SMILES:
NCCCCCC(C[Se]C(=O)CCCc1ccccc1)C(O)=O
: