Target
Proprotein convertase subtilisin/kexin type 6
Ligand
BDBM50399752
Substrate
Meas. Tech.
ChEMBL_877191 (CHEMBL2187699)
pH
6.5±n/a
Ki
1.3±n/a nM
Comments
extracted
Citation
 Levesque, CFugère, MKwiatkowska, ACouture, FDesjardins, RRouthier, SMoussette, PPrahl, ALammek, BAppel, JRHoughten, RAD'Anjou, FDory, YLNeugebauer, WDay, R The Multi-Leu peptide inhibitor discriminates between PACE4 and furin and exhibits antiproliferative effects on prostate cancer cells. J Med Chem 55:10501-11 (2012)  
Target
Name:
Proprotein convertase subtilisin/kexin type 6
Synonyms:
PACE4 PCSK6_HUMAN | Subtilisin/kexin type 6
Type:
PROTEIN
Mol. Mass.:
106442.22
Organism:
Homo sapiens (Human)
Description:
ChEMBL_1290742
Residue:
969
  
Inhibitor
Name:
BDBM50399752
Synonyms:
CHEMBL2179429
Type:
Small organic molecule
Emp. Form.:
C39H78N16O9
Mol. Mass.:
915.1384
SMILES:
[#6]-[#6](-[#6])-[#6@H](-[#7])-[#6](=O)-[#7]-[#6@@H](-[#6]-[#6]-[#6]-[#6]-[#7])-[#6](=O)-[#7]-[#6@@H](-[#6]-[#6]-[#6]-[#6]-[#7])-[#6](=O)-[#7]-[#6@@H](-[#6]-[#6]-[#6]\[#7]=[#6](/[#7])-[#7])-[#6](=O)-[#7]-[#6@@H](-[#6@@H](-[#6])-[#8])-[#6](=O)-[#7]-[#6@@H](-[#6]-[#6]-[#6]-[#6]-[#7])-[#6](=O)-[#7]-[#6@@H](-[#6]-[#6]-[#6]\[#7]=[#6](/[#7])-[#7])-[#6](-[#8])=O
: