Target
Aminopeptidase N
Ligand
BDBM50400199
Substrate
Meas. Tech.
ChEMBL_878907 (CHEMBL2185058)
IC50
4550±n/a nM
Citation
 Deprez-Poulain, RFlipo, MPiveteau, CLeroux, FDassonneville, SFlorent, IMaes, LCos, PDeprez, B Structure-activity relationships and blood distribution of antiplasmodial aminopeptidase-1 inhibitors. J Med Chem 55:10909-17 (2012)  
Target
Name:
Aminopeptidase N
Synonyms:
AMPN_PIG AP-M Alanyl aminopeptidase Aminopeptidase N (APN) Microsomal aminopeptidase pAPN
Type:
Protein
Mol. Mass.:
108810.25
Organism:
Sus scrofa (Pig)
Description:
P15145
Residue:
963
  
Inhibitor
Name:
BDBM50400199
Synonyms:
CHEMBL2180997
Type:
Small organic molecule
Emp. Form.:
C16H17N3O3
Mol. Mass.:
299.3245
SMILES:
ONC(=O)C(Cc1ccccc1)C(=O)NCc1ccncc1
: