Target
Aminopeptidase N
Ligand
BDBM50400198
Substrate
Meas. Tech.
ChEMBL_878907 (CHEMBL2185058)
IC50
>10000±n/a nM
Citation
 Deprez-Poulain, RFlipo, MPiveteau, CLeroux, FDassonneville, SFlorent, IMaes, LCos, PDeprez, B Structure-activity relationships and blood distribution of antiplasmodial aminopeptidase-1 inhibitors. J Med Chem 55:10909-17 (2012)  
Target
Name:
Aminopeptidase N
Synonyms:
AMPN_PIG AP-M Alanyl aminopeptidase Aminopeptidase N (APN) Microsomal aminopeptidase pAPN
Type:
Protein
Mol. Mass.:
108810.25
Organism:
Sus scrofa (Pig)
Description:
P15145
Residue:
963
  
Inhibitor
Name:
BDBM50400198
Synonyms:
CHEMBL572368
Type:
Small organic molecule
Emp. Form.:
C18H19FN2O3
Mol. Mass.:
330.3535
SMILES:
CC(Cc1ccccc1)(C(=O)NO)C(=O)NCc1ccc(F)cc1
: