Target
Aminopeptidase N
Ligand
BDBM50062474
Substrate
Meas. Tech.
ChEMBL_878907 (CHEMBL2185058)
IC50
>10000±n/a nM
Citation
 Deprez-Poulain, RFlipo, MPiveteau, CLeroux, FDassonneville, SFlorent, IMaes, LCos, PDeprez, B Structure-activity relationships and blood distribution of antiplasmodial aminopeptidase-1 inhibitors. J Med Chem 55:10909-17 (2012)  
Target
Name:
Aminopeptidase N
Synonyms:
AMPN_PIG AP-M Alanyl aminopeptidase Aminopeptidase N (APN) Microsomal aminopeptidase pAPN
Type:
Protein
Mol. Mass.:
108810.25
Organism:
Sus scrofa (Pig)
Description:
P15145
Residue:
963
  
Inhibitor
Name:
BDBM50062474
Synonyms:
2,N-Dibenzyl-N'-hydroxy-malonamide CHEMBL113827 | N1,2-dibenzyl-N3-hydroxymalonamide
Type:
Small organic molecule
Emp. Form.:
C17H18N2O3
Mol. Mass.:
298.3364
SMILES:
ONC(=O)C(Cc1ccccc1)C(=O)NCc1ccccc1
: