Target
Aminopeptidase N
Ligand
BDBM50206556
Substrate
Meas. Tech.
ChEMBL_878907 (CHEMBL2185058)
IC50
3616±n/a nM
Citation
 Deprez-Poulain, RFlipo, MPiveteau, CLeroux, FDassonneville, SFlorent, IMaes, LCos, PDeprez, B Structure-activity relationships and blood distribution of antiplasmodial aminopeptidase-1 inhibitors. J Med Chem 55:10909-17 (2012)  
Target
Name:
Aminopeptidase N
Synonyms:
AMPN_PIG AP-M Alanyl aminopeptidase Aminopeptidase N (APN) Microsomal aminopeptidase pAPN
Type:
Protein
Mol. Mass.:
108810.25
Organism:
Sus scrofa (Pig)
Description:
P15145
Residue:
963
  
Inhibitor
Name:
BDBM50206556
Synonyms:
2-Benzyl-N-(4-fluoro-benzyl)-N'-hydroxy-malonamide N1-(4-fluorobenzyl)-2-benzyl-N3-hydroxymalonamide
Type:
Small organic molecule
Emp. Form.:
C17H17FN2O3
Mol. Mass.:
316.3269
SMILES:
ONC(=O)C(Cc1ccccc1)C(=O)NCc1ccc(F)cc1
: