Target
Aminopeptidase N
Ligand
BDBM50206555
Substrate
Meas. Tech.
ChEMBL_878907 (CHEMBL2185058)
IC50
>10000±n/a nM
Citation
 Deprez-Poulain, RFlipo, MPiveteau, CLeroux, FDassonneville, SFlorent, IMaes, LCos, PDeprez, B Structure-activity relationships and blood distribution of antiplasmodial aminopeptidase-1 inhibitors. J Med Chem 55:10909-17 (2012)  
Target
Name:
Aminopeptidase N
Synonyms:
AMPN_PIG AP-M Alanyl aminopeptidase Aminopeptidase N (APN) Microsomal aminopeptidase pAPN
Type:
Protein
Mol. Mass.:
108810.25
Organism:
Sus scrofa (Pig)
Description:
P15145
Residue:
963
  
Inhibitor
Name:
BDBM50206555
Synonyms:
2-[1-Phenyl-meth-(Z)-ylidene]-malonic Acid Monoethyl Ester N-(4-Fluoro-benzyl)-N'-hydroxy-2-[1-phenyl-meth-(E)-ylidene]-malonamide
Type:
Small organic molecule
Emp. Form.:
C17H15FN2O3
Mol. Mass.:
314.311
SMILES:
ONC(=O)C(=C\c1ccccc1)\C(=O)NCc1ccc(F)cc1
: