Target
Peroxisome proliferator-activated receptor alpha
Ligand
BDBM50401010
Substrate
Meas. Tech.
ChEMBL_880124 (CHEMBL2214360)
EC50
122±n/a nM
Citation
 Porcelli, LGilardi, FLaghezza, APiemontese, LMitro, NAzzariti, AAltieri, FCervoni, LFracchiolla, GGiudici, MGuerrini, ULavecchia, AMontanari, RDi Giovanni, CParadiso, APochetti, GSimone, GMTortorella, PCrestani, MLoiodice, F Synthesis, characterization and biological evaluation of ureidofibrate-like derivatives endowed with peroxisome proliferator-activated receptor activity. J Med Chem 55:37-54 (2012)  
Target
Name:
Peroxisome proliferator-activated receptor alpha
Synonyms:
NR1C1 PPAR PPAR-alpha PPARA_HUMAN Peroxisome proliferator-activated receptor | Peroxisome proliferator-activated receptor alpha (PPAR alpha)
Type:
Enzyme
Mol. Mass.:
52222.08
Organism:
Homo sapiens (Human)
Description:
Q07869
Residue:
468
  
Inhibitor
Name:
BDBM50401010
Synonyms:
CHEMBL2206304
Type:
Small organic molecule
Emp. Form.:
C24H29N2O4
Mol. Mass.:
409.4986
SMILES:
CCCCCCCN(CCc1ccc(OCC([O-])=O)cc1)c1nc2ccccc2o1
: