Target
Peroxisome proliferator-activated receptor alpha
Ligand
BDBM50401011
Substrate
Meas. Tech.
ChEMBL_880124 (CHEMBL2214360)
EC50
620±n/a nM
Citation
 Porcelli, LGilardi, FLaghezza, APiemontese, LMitro, NAzzariti, AAltieri, FCervoni, LFracchiolla, GGiudici, MGuerrini, ULavecchia, AMontanari, RDi Giovanni, CParadiso, APochetti, GSimone, GMTortorella, PCrestani, MLoiodice, F Synthesis, characterization and biological evaluation of ureidofibrate-like derivatives endowed with peroxisome proliferator-activated receptor activity. J Med Chem 55:37-54 (2012)  
Target
Name:
Peroxisome proliferator-activated receptor alpha
Synonyms:
NR1C1 PPAR PPAR-alpha PPARA_HUMAN Peroxisome proliferator-activated receptor | Peroxisome proliferator-activated receptor alpha (PPAR alpha)
Type:
Enzyme
Mol. Mass.:
52222.08
Organism:
Homo sapiens (Human)
Description:
Q07869
Residue:
468
  
Inhibitor
Name:
BDBM50401011
Synonyms:
CHEMBL2206303
Type:
Small organic molecule
Emp. Form.:
C25H31N2O4
Mol. Mass.:
423.5252
SMILES:
CCCCCCCN(CCc1ccc(O[C@@H](C)C([O-])=O)cc1)c1nc2ccccc2o1
: