Target
Peroxisome proliferator-activated receptor alpha
Ligand
BDBM28763
Substrate
Meas. Tech.
ChEMBL_880124 (CHEMBL2214360)
EC50
56±n/a nM
Citation
 Porcelli, LGilardi, FLaghezza, APiemontese, LMitro, NAzzariti, AAltieri, FCervoni, LFracchiolla, GGiudici, MGuerrini, ULavecchia, AMontanari, RDi Giovanni, CParadiso, APochetti, GSimone, GMTortorella, PCrestani, MLoiodice, F Synthesis, characterization and biological evaluation of ureidofibrate-like derivatives endowed with peroxisome proliferator-activated receptor activity. J Med Chem 55:37-54 (2012)  
Target
Name:
Peroxisome proliferator-activated receptor alpha
Synonyms:
NR1C1 PPAR PPAR-alpha PPARA_HUMAN Peroxisome proliferator-activated receptor | Peroxisome proliferator-activated receptor alpha (PPAR alpha)
Type:
Enzyme
Mol. Mass.:
52222.08
Organism:
Homo sapiens (Human)
Description:
Q07869
Residue:
468
  
Inhibitor
Name:
BDBM28763
Synonyms:
(2S)-2-(4-{2-[1,3-benzoxazol-2-yl(heptyl)amino]ethyl}phenoxy)-2-methylbutanoic acid | LT127 (ureidofibrate derivative), (S)-1
Type:
Small organic molecule
Emp. Form.:
C27H36N2O4
Mol. Mass.:
452.5857
SMILES:
CCCCCCCN(CCc1ccc(O[C@@](C)(CC)C(O)=O)cc1)c1nc2ccccc2o1
: