Target
Peroxisome proliferator-activated receptor gamma
Ligand
BDBM50401013
Substrate
Meas. Tech.
ChEMBL_880132 (CHEMBL2214368)
Kd
4500±n/a nM
Citation
 Porcelli, LGilardi, FLaghezza, APiemontese, LMitro, NAzzariti, AAltieri, FCervoni, LFracchiolla, GGiudici, MGuerrini, ULavecchia, AMontanari, RDi Giovanni, CParadiso, APochetti, GSimone, GMTortorella, PCrestani, MLoiodice, F Synthesis, characterization and biological evaluation of ureidofibrate-like derivatives endowed with peroxisome proliferator-activated receptor activity. J Med Chem 55:37-54 (2012)  
Target
Name:
Peroxisome proliferator-activated receptor gamma
Synonyms:
NR1C3 PPAR-gamma PPARG_HUMAN Peroxisome proliferator-activated receptor gamma (PPAR gamma) Peroxisome proliferator-activated receptor gamma (PPARĪ³) peroxisome proliferator-activated receptor gamma isoform 2
Type:
Nuclear Receptor
Mol. Mass.:
57613.46
Organism:
Homo sapiens (Human)
Description:
P37231
Residue:
505
  
Inhibitor
Name:
BDBM50401013
Synonyms:
CHEMBL477312
Type:
Small organic molecule
Emp. Form.:
C26H34N2O4
Mol. Mass.:
438.5592
SMILES:
CCCCCCCN(CCc1ccc(OC(C)(C)C(O)=O)cc1)c1nc2ccccc2o1
: