Target
Peroxisome proliferator-activated receptor delta
Ligand
BDBM50401012
Substrate
Meas. Tech.
ChEMBL_880128 (CHEMBL2214364)
EC50
130±n/a nM
Citation
 Porcelli, LGilardi, FLaghezza, APiemontese, LMitro, NAzzariti, AAltieri, FCervoni, LFracchiolla, GGiudici, MGuerrini, ULavecchia, AMontanari, RDi Giovanni, CParadiso, APochetti, GSimone, GMTortorella, PCrestani, MLoiodice, F Synthesis, characterization and biological evaluation of ureidofibrate-like derivatives endowed with peroxisome proliferator-activated receptor activity. J Med Chem 55:37-54 (2012)  
Target
Name:
Peroxisome proliferator-activated receptor delta
Synonyms:
NR1C2 NUCI Nuclear receptor subfamily 1 group C member 2 PPAR-beta PPARD Peroxisome proliferator-activated receptor Peroxisome proliferator-activated receptor delta
Type:
Enzyme
Mol. Mass.:
49910.45
Organism:
Homo sapiens (Human)
Description:
Q03181
Residue:
441
  
Inhibitor
Name:
BDBM50401012
Synonyms:
CHEMBL2206302
Type:
Small organic molecule
Emp. Form.:
C25H31N2O4
Mol. Mass.:
423.5252
SMILES:
CCCCCCCN(CCc1ccc(O[C@H](C)C([O-])=O)cc1)c1nc2ccccc2o1
: