Target
Integrin alpha-IIb/beta-3
Ligand
BDBM50107405
Substrate
Meas. Tech.
ChEMBL_90003 (CHEMBL701676)
IC50
>10000±n/a nM
Citation
 Meissner, RSPerkins, JJDuong, le THartman, GDHoffman, WFHuff, JRIhle, NCLeu, CTNagy, RMNaylor-Olsen, ARodan, GARodan, SBWhitman, DBWesolowski, GADuggan, ME Nonpeptide alpha(v)beta(3) antagonists. Part 2: constrained glycyl amides derived from the RGD tripeptide. Bioorg Med Chem Lett 12:25-9 (2001)  
Target
Name:
Integrin alpha-IIb/beta-3
Synonyms:
Glycoprotein IIb/IIIa
Type:
Mol. Mass.:
Description:
ASSAY_ID of EBI is 30109
Components:
This complex has 2 components.
Component 1
Name:
Integrin beta-3
Synonyms:
CD_antigen=CD61 GPIIIa ITGB3 Platelet membrane glycoprotein IIIa
Type:
Protein
Mol. Mass.:
87038.91
Organism:
Homo sapiens (Human)
Description:
P05106
Residue:
788
  
Component 2
Name:
Integrin alpha-IIb
Synonyms:
CD_antigen=CD41 GPIIb Glycoprotein IIb ITGA2B Integrin alpha-IIb heavy chain Integrin alpha-IIb light chain, form 2 Integrin alpha-V/beta-3 and alpha-IIb/beta 3 | Platelet membrane glycoprotein IIb
Type:
Protein
Mol. Mass.:
113354.85
Organism:
Homo sapiens (Human)
Description:
P08514
Residue:
1039
  
Inhibitor
Name:
BDBM50107405
Synonyms:
3-[2-(4-5,6,7,8-Tetrahydro-[1,8]naphthyridin-2-yl-butyrylamino)-acetylamino]-propionic acid | CHEMBL82927
Type:
Small organic molecule
Emp. Form.:
C17H24N4O4
Mol. Mass.:
348.3969
SMILES:
OC(=O)CCNC(=O)CNC(=O)CCCc1ccc2CCCNc2n1
: