Target
Thymidylate synthase
Ligand
BDBM50408133
Substrate
Meas. Tech.
ChEMBL_209984 (CHEMBL821265)
Ki
18±n/a nM
Citation
 Bavetsias, VJackman, ALMarriott, JHKimbell, RGibson, WBoyle, FTBisset, GM Folate-based inhibitors of thymidylate synthase: synthesis and antitumor activity of gamma-linked sterically hindered dipeptide analogues of 2-desamino-2-methyl-N10-propargyl-5,8-dideazafolic acid (ICI 198583). J Med Chem 40:1495-510 (1997)  
Target
Name:
Thymidylate synthase
Synonyms:
TS TYSY_MOUSE | Tyms
Type:
PROTEIN
Mol. Mass.:
34957.15
Organism:
Mus musculus
Description:
ChEMBL_1340097
Residue:
307
  
Inhibitor
Name:
BDBM50408133
Synonyms:
CHEMBL287693
Type:
Small organic molecule
Emp. Form.:
C32H35N5O9
Mol. Mass.:
633.6484
SMILES:
Cc1nc2ccc(CN(CC#C)c3ccc(cc3)C(=O)N[C@@H](CC(C)(C)C(O)=O)C(=O)N[C@@H](CCC(O)=O)C(O)=O)cc2c(=O)[nH]1
: