Target
Thymidylate synthase
Ligand
BDBM50408134
Substrate
Meas. Tech.
ChEMBL_209984 (CHEMBL821265)
Ki
50±n/a nM
Citation
 Bavetsias, VJackman, ALMarriott, JHKimbell, RGibson, WBoyle, FTBisset, GM Folate-based inhibitors of thymidylate synthase: synthesis and antitumor activity of gamma-linked sterically hindered dipeptide analogues of 2-desamino-2-methyl-N10-propargyl-5,8-dideazafolic acid (ICI 198583). J Med Chem 40:1495-510 (1997)  
Target
Name:
Thymidylate synthase
Synonyms:
TS TYSY_MOUSE | Tyms
Type:
PROTEIN
Mol. Mass.:
34957.15
Organism:
Mus musculus
Description:
ChEMBL_1340097
Residue:
307
  
Inhibitor
Name:
BDBM50408134
Synonyms:
CHEMBL35941
Type:
Small organic molecule
Emp. Form.:
C28H29N5O7
Mol. Mass.:
547.5592
SMILES:
CN(CC(O)=O)C(=O)[C@H](CCC(O)=O)NC(=O)c1ccc(cc1)N(CC#C)Cc1ccc2nc(C)[nH]c(=O)c2c1
: