Target
Gastrin/cholecystokinin type B receptor
Ligand
BDBM50411346
Substrate
Meas. Tech.
ChEMBL_439007 (CHEMBL889353)
Ki
5.2±n/a nM
Citation
 McDonald, IMBlack, JWBuck, IMDunstone, DJGriffin, EPHarper, EAHull, RAKalindjian, SBLilley, EJLinney, IDPether, MJRoberts, SPShaxted, MESpencer, JSteel, KISykes, DAWalker, MKWatt, GFWright, LWright, PTXun, W Optimization of 1,3,4-benzotriazepine-based CCK(2) antagonists to obtain potent, orally active inhibitors of gastrin-mediated gastric acid secretion. J Med Chem 50:3101-12 (2007)  
Target
Name:
Gastrin/cholecystokinin type B receptor
Synonyms:
CCKBR Cholecystokinin B receptor Gastrin/cholecystokinin type B receptor
Type:
Enzyme Catalytic Domain
Mol. Mass.:
48544.19
Organism:
Dog
Description:
Cholecystokinin B 0 Dog::P30552
Residue:
453
  
Inhibitor
Name:
BDBM50411346
Synonyms:
CHEMBL226673
Type:
Small organic molecule
Emp. Form.:
C30H36N4O5
Mol. Mass.:
532.6306
SMILES:
CC(C)(C)C(=O)CN1c2ccccc2C(=NN(CC(=O)Nc2cccc(CC(O)=O)c2)C1=O)C1CCCCC1
: