Target
Somatostatin receptor type 1
Ligand
BDBM50423305
Substrate
Meas. Tech.
ChEMBL_456079 (CHEMBL888088)
Kd
158±n/a nM
Citation
 Troxler, THoyer, DLangenegger, DNeumann, PPfäffli, PSchoeffter, PSorg, DSwoboda, RHurth, K Identification and SAR of potent and selective non-peptide obeline somatostatin sst1 receptor antagonists. Bioorg Med Chem Lett 17:3983-7 (2007)  
Target
Name:
Somatostatin receptor type 1
Synonyms:
SOMATOSTATIN SST1 SS1R Somatostatin receptor Sstr1
Type:
Enzyme Catalytic Domain
Mol. Mass.:
42752.93
Organism:
RAT
Description:
SOMATOSTATIN SST1 SSTR1 RAT::P28646
Residue:
391
  
Inhibitor
Name:
BDBM50423305
Synonyms:
CHEMBL251335
Type:
Small organic molecule
Emp. Form.:
C24H30N4O
Mol. Mass.:
390.5212
SMILES:
CN1C[C@@H](C[C@@H]2Cc3ccccc3C[C@@H]12)C(=O)N1CCN(CC1)c1ccccn1
: