Target
Somatostatin receptor type 2
Ligand
BDBM50423359
Substrate
Meas. Tech.
ChEMBL_456105 (CHEMBL888114)
Kd
16596±n/a nM
Citation
 Hurth, KEnz, AFloersheim, PGentsch, CHoyer, DLangenegger, DNeumann, PPfäffli, PSorg, DSwoboda, RVassout, ATroxler, T SAR of the arylpiperazine moiety of obeline somatostatin sst1 receptor antagonists. Bioorg Med Chem Lett 17:3988-91 (2007)  
Target
Name:
Somatostatin receptor type 2
Synonyms:
SOMATOSTATIN SST2 SS2R Somatostatin receptor Somatostatin receptor type 2 | Sstr2
Type:
Enzyme Catalytic Domain
Mol. Mass.:
41212.21
Organism:
RAT
Description:
SOMATOSTATIN SST2 SSTR2 RAT::P30680
Residue:
369
  
Inhibitor
Name:
BDBM50423359
Synonyms:
CHEMBL249892
Type:
Small organic molecule
Emp. Form.:
C27H34N4O3
Mol. Mass.:
462.5839
SMILES:
COc1cccc2C[C@@H]3[C@H](C[C@H](CN3C)C(=O)N3CCN(CC3)c3ccc(cc3)C(N)=O)Cc12
: