Target
Somatostatin receptor type 2
Ligand
BDBM50423469
Substrate
Meas. Tech.
ChEMBL_461986 (CHEMBL944829)
Kd
7943±n/a nM
Citation
 Troxler, TEnz, AHoyer, DLangenegger, DNeumann, PPfäffli, PSchoeffter, PHurth, K Ergoline derivatives as highly potent and selective antagonists at the somatostatin sst 1 receptor. Bioorg Med Chem Lett 18:979-82 (2008)  
Target
Name:
Somatostatin receptor type 2
Synonyms:
SOMATOSTATIN SST2 SS2R Somatostatin receptor Somatostatin receptor type 2 | Sstr2
Type:
Enzyme Catalytic Domain
Mol. Mass.:
41212.21
Organism:
RAT
Description:
SOMATOSTATIN SST2 SSTR2 RAT::P30680
Residue:
369
  
Inhibitor
Name:
BDBM50423469
Synonyms:
CHEMBL252002
Type:
Small organic molecule
Emp. Form.:
C24H26BrN5O
Mol. Mass.:
480.4
SMILES:
Brc1[nH]c2cccc3[C@H]4C[C@H](CN[C@@H]4Cc1c23)C(=O)N1CCN(CC1)c1ccccn1
: