Target
Neuropeptides B/W receptor type 1
Ligand
BDBM50425570
Substrate
Meas. Tech.
ChEMBL_936637 (CHEMBL2319036)
IC50
580±n/a nM
Citation
 Guerrero, MUrbano, MSchaeffer, MTBrown, SRosen, HRoberts, E SAR analysis of novel non-peptidic NPBWR1 (GPR7) antagonists. Bioorg Med Chem Lett 23:614-9 (2013)  
Target
Name:
Neuropeptides B/W receptor type 1
Synonyms:
GPR7 NPBWR1 | neuropeptides B/W receptor 1
Type:
Enzyme Catalytic Domain
Mol. Mass.:
36111.82
Organism:
Homo sapiens (Human)
Description:
gi_119607128
Residue:
328
  
Inhibitor
Name:
BDBM50425570
Synonyms:
CHEMBL2314620
Type:
Small organic molecule
Emp. Form.:
C25H19ClN2O4
Mol. Mass.:
446.882
SMILES:
COc1ccc(Oc2c(Cl)cnn(C(C(=O)c3ccccc3)c3ccccc3)c2=O)cc1
: