Target
Neuropeptides B/W receptor type 1
Ligand
BDBM50425576
Substrate
Meas. Tech.
ChEMBL_936637 (CHEMBL2319036)
IC50
430±n/a nM
Citation
 Guerrero, MUrbano, MSchaeffer, MTBrown, SRosen, HRoberts, E SAR analysis of novel non-peptidic NPBWR1 (GPR7) antagonists. Bioorg Med Chem Lett 23:614-9 (2013)  
Target
Name:
Neuropeptides B/W receptor type 1
Synonyms:
GPR7 NPBWR1 | neuropeptides B/W receptor 1
Type:
Enzyme Catalytic Domain
Mol. Mass.:
36111.82
Organism:
Homo sapiens (Human)
Description:
gi_119607128
Residue:
328
  
Inhibitor
Name:
BDBM50425576
Synonyms:
CHEMBL2314299
Type:
Small organic molecule
Emp. Form.:
C23H17ClN2O3
Mol. Mass.:
404.846
SMILES:
Clc1cnn(Cc2cccc3ccccc23)c(=O)c1Oc1ccc2OCCc2c1
: