Target
Neuropeptides B/W receptor type 1
Ligand
BDBM50425628
Substrate
Meas. Tech.
ChEMBL_936637 (CHEMBL2319036)
IC50
1000±n/a nM
Citation
 Guerrero, MUrbano, MSchaeffer, MTBrown, SRosen, HRoberts, E SAR analysis of novel non-peptidic NPBWR1 (GPR7) antagonists. Bioorg Med Chem Lett 23:614-9 (2013)  
Target
Name:
Neuropeptides B/W receptor type 1
Synonyms:
GPR7 NPBWR1 | neuropeptides B/W receptor 1
Type:
Enzyme Catalytic Domain
Mol. Mass.:
36111.82
Organism:
Homo sapiens (Human)
Description:
gi_119607128
Residue:
328
  
Inhibitor
Name:
BDBM50425628
Synonyms:
CHEMBL2314310
Type:
Small organic molecule
Emp. Form.:
C19H14ClF3N2O3
Mol. Mass.:
410.774
SMILES:
COc1ccc(Oc2c(Cl)cnn(Cc3ccc(cc3)C(F)(F)F)c2=O)cc1
: