Target
Tyrosine-protein kinase ABL1
Ligand
BDBM50425789
Substrate
Meas. Tech.
ChEMBL_937547 (CHEMBL2320772)
IC50
7.1±n/a nM
Citation
 Ren, XPan, XZhang, ZWang, DLu, XLi, YWen, DLong, HLuo, JFeng, YZhuang, XZhang, FLiu, JLeng, FLang, XBai, YShe, MTu, ZPan, JDing, K Identification of GZD824 as an orally bioavailable inhibitor that targets phosphorylated and nonphosphorylated breakpoint cluster region-Abelson (Bcr-Abl) kinase and overcomes clinically acquired mutation-induced resistance against imatinib. J Med Chem 56:879-94 (2013)  
Target
Name:
Tyrosine-protein kinase ABL1
Synonyms:
ABL ABL1_HUMAN JTK7 Proto-oncogene tyrosine-protein kinase ABL1 Tyrosine-protein kinase ABL V-abl Abelson murine leukemia viral oncogene homolog 1 p150 | tyrosine-protein kinase ABL1 isoform a
Type:
Enzyme
Mol. Mass.:
122897.30
Organism:
Homo sapiens (Human)
Description:
P00519
Residue:
1130
  
Inhibitor
Name:
BDBM50425789
Synonyms:
CHEMBL2316585
Type:
Small organic molecule
Emp. Form.:
C31H29F3N6O
Mol. Mass.:
558.5968
SMILES:
CN1CCN(Cc2ccc(NC(=O)c3ccc(C4CC4)c(c3)C#Cc3cnc4[nH]ncc4c3)cc2C(F)(F)F)CC1
: