Target
Nuclear factor NF-kappa-B p105 subunit
Ligand
BDBM50331546
Substrate
Meas. Tech.
ChEMBL_941587 (CHEMBL2330627)
EC50
30000±n/a nM
Citation
 Marzaro, GGuiotto, ABorgatti, MFinotti, AGambari, RBreveglieri, GChilin, A Psoralen derivatives as inhibitors of NF-¿B/DNA interaction: synthesis, molecular modeling, 3D-QSAR, and biological evaluation. J Med Chem 56:1830-42 (2013)  
Target
Name:
Nuclear factor NF-kappa-B p105 subunit
Synonyms:
NFKB1 Nuclear factor NF-kappa-B (NF-kB) Nuclear factor NF-kappa-B p105 subunit
Type:
Protein
Mol. Mass.:
105329.57
Organism:
Homo sapiens (Human)
Description:
P19838
Residue:
968
  
Inhibitor
Name:
BDBM50331546
Synonyms:
2-(4,5,6-trihydroxy-3-oxo-3H-xanthen-9-yl)benzenesulfonic acid cid_360404 | pyrogallol red
Type:
Small organic molecule
Emp. Form.:
C19H12O8S
Mol. Mass.:
400.359
SMILES:
Oc1ccc2c(-c3ccccc3S(O)(=O)=O)c3ccc(=O)c(O)c3oc2c1O
: