Target
Bifunctional epoxide hydrolase 2
Ligand
BDBM50435745
Substrate
Meas. Tech.
ChEMBL_965765 (CHEMBL2393704)
IC50
1.000000±n/a nM
Citation
 Thalji, RKMcAtee, JJBelyanskaya, SBrandt, MBrown, GDCostell, MHDing, YDodson, JWEisennagel, SHFries, REGross, JWHarpel, MRHolt, DAIsrael, DIJolivette, LJKrosky, DLi, HLu, QMandichak, TRoethke, TSchnackenberg, CGSchwartz, BShewchuk, LMXie, WBehm, DJDouglas, SAShaw, ALMarino, JP Discovery of 1-(1,3,5-triazin-2-yl)piperidine-4-carboxamides as inhibitors of soluble epoxide hydrolase. Bioorg Med Chem Lett 23:3584-8 (2013)  
Target
Name:
Bifunctional epoxide hydrolase 2
Synonyms:
Cytosolic epoxide hydrolase 2 EPHX2 HYES_HUMAN Soluble epoxide hydrolase (sEH) | epoxide hydrolase 2, cytoplasmic
Type:
Enzyme
Mol. Mass.:
62613.07
Organism:
Homo sapiens (Human)
Description:
P34913
Residue:
555
  
Inhibitor
Name:
BDBM50435745
Synonyms:
CHEMBL2392706
Type:
Small organic molecule
Emp. Form.:
C19H23F3N6O2
Mol. Mass.:
424.4201
SMILES:
CNc1nc(C)nc(n1)N1CCC(CC1)C(=O)NCc1ccccc1OC(F)(F)F
: