Target
Bifunctional epoxide hydrolase 2
Ligand
BDBM50435761
Substrate
Meas. Tech.
ChEMBL_965765 (CHEMBL2393704)
IC50
80±n/a nM
Citation
 Thalji, RKMcAtee, JJBelyanskaya, SBrandt, MBrown, GDCostell, MHDing, YDodson, JWEisennagel, SHFries, REGross, JWHarpel, MRHolt, DAIsrael, DIJolivette, LJKrosky, DLi, HLu, QMandichak, TRoethke, TSchnackenberg, CGSchwartz, BShewchuk, LMXie, WBehm, DJDouglas, SAShaw, ALMarino, JP Discovery of 1-(1,3,5-triazin-2-yl)piperidine-4-carboxamides as inhibitors of soluble epoxide hydrolase. Bioorg Med Chem Lett 23:3584-8 (2013)  
Target
Name:
Bifunctional epoxide hydrolase 2
Synonyms:
Cytosolic epoxide hydrolase 2 EPHX2 HYES_HUMAN Soluble epoxide hydrolase (sEH) | epoxide hydrolase 2, cytoplasmic
Type:
Enzyme
Mol. Mass.:
62613.07
Organism:
Homo sapiens (Human)
Description:
P34913
Residue:
555
  
Inhibitor
Name:
BDBM50435761
Synonyms:
CHEMBL2392713
Type:
Small organic molecule
Emp. Form.:
C23H33F3N8O
Mol. Mass.:
494.5563
SMILES:
CNc1nc(nc(n1)N1CCC(CC1)C(=O)NCc1ccccc1C(F)(F)F)N(C)CCN(C)C
: