Target
Cytochrome P450 2C9
Ligand
BDBM50435757
Substrate
Meas. Tech.
ChEMBL_965762 (CHEMBL2393701)
IC50
1800±n/a nM
Citation
 Thalji, RKMcAtee, JJBelyanskaya, SBrandt, MBrown, GDCostell, MHDing, YDodson, JWEisennagel, SHFries, REGross, JWHarpel, MRHolt, DAIsrael, DIJolivette, LJKrosky, DLi, HLu, QMandichak, TRoethke, TSchnackenberg, CGSchwartz, BShewchuk, LMXie, WBehm, DJDouglas, SAShaw, ALMarino, JP Discovery of 1-(1,3,5-triazin-2-yl)piperidine-4-carboxamides as inhibitors of soluble epoxide hydrolase. Bioorg Med Chem Lett 23:3584-8 (2013)  
Target
Name:
Cytochrome P450 2C9
Synonyms:
(R)-limonene 6-monooxygenase CP2C9_HUMAN CYP2C9 Cytochrome P450 2C9 (CYP2C9 ) P-450MP P450 PB-1 | S-mephenytoin 4-hydroxylase
Type:
Enzyme
Mol. Mass.:
55636.33
Organism:
Homo sapiens (Human)
Description:
P11712
Residue:
490
  
Inhibitor
Name:
BDBM50435757
Synonyms:
CHEMBL2392694
Type:
Small organic molecule
Emp. Form.:
C24H25F3N6O
Mol. Mass.:
470.4901
SMILES:
CNc1nc(nc(n1)-c1ccccc1)N1CCC(CC1)C(=O)NCc1ccccc1C(F)(F)F
: