Target
N-formyl peptide receptor 3
Ligand
BDBM50435894
Substrate
Meas. Tech.
ChEMBL_963919 (CHEMBL2393754)
EC50
>50000±n/a nM
Citation
 Giovannoni, MPSchepetkin, IACilibrizzi, ACrocetti, LKhlebnikov, AIDahlgren, CGraziano, ADal Piaz, VKirpotina, LNZerbinati, SVergelli, CQuinn, MT Further studies on 2-arylacetamide pyridazin-3(2H)-ones: design, synthesis and evaluation of 4,6-disubstituted analogs as formyl peptide receptors (FPRs) agonists. Eur J Med Chem 64:512-28 (2013)  
Target
Name:
N-formyl peptide receptor 3
Synonyms:
FML2_HUMAN FPR3_HUMAN FPRL2
Type:
PROTEIN
Mol. Mass.:
39971.00
Organism:
Homo sapiens (Human)
Description:
ChEMBL_580003
Residue:
353
  
Inhibitor
Name:
BDBM50435894
Synonyms:
CHEMBL2391449
Type:
Small organic molecule
Emp. Form.:
C20H19BrN4O3
Mol. Mass.:
443.294
SMILES:
COc1ccc(Nc2cc(C)nn(CC(=O)Nc3ccc(Br)cc3)c2=O)cc1
: