Target
Cytochrome P450 2C8
Ligand
BDBM50438845
Substrate
Meas. Tech.
ChEMBL_977241 (CHEMBL2416912)
IC50
120±n/a nM
Citation
 Tukulula, MNjoroge, MMugumbate, GCGut, JRosenthal, PJBarteau, SStreckfuss, JHeudi, OKameni-Tcheudji, JChibale, K Tetrazole-based deoxyamodiaquines: synthesis, ADME/PK profiling and pharmacological evaluation as potential antimalarial agents. Bioorg Med Chem 21:4904-13 (2013)  
Target
Name:
Cytochrome P450 2C8
Synonyms:
CP2C8_HUMAN CYPIIC8 P450 IIC2 P450 form 1 | S-mephenytoin 4-hydroxylase
Type:
Protein
Mol. Mass.:
55839.23
Organism:
Homo sapiens (Human)
Description:
P10632
Residue:
490
  
Inhibitor
Name:
BDBM50438845
Synonyms:
CHEMBL2413882
Type:
Small organic molecule
Emp. Form.:
C25H28ClN7
Mol. Mass.:
461.99
SMILES:
CC(C)(C)n1nnnc1C(N1CCCC1)c1cccc(Nc2ccnc3cc(Cl)ccc23)c1
: