Target
Fatty-acid amide hydrolase 1 [30-579]
Ligand
BDBM50447653
Substrate
Meas. Tech.
ChEMBL_1289463 (CHEMBL3117157)
IC50
42±n/a nM
Citation
 Keith, JMJones, WMPierce, JMSeierstad, MPalmer, JAWebb, MKarbarz, MJScott, BPWilson, SJLuo, LWennerholm, MLChang, LBrown, SMRizzolio, MRynberg, RChaplan, SRBreitenbucher, JG Heteroarylureas with spirocyclic diamine cores as inhibitors of fatty acid amide hydrolase. Bioorg Med Chem Lett 24:737-41 (2014)  
Target
Name:
Fatty-acid amide hydrolase 1 [30-579]
Synonyms:
Anandamide amidohydrolase 1 Faah Fatty Acid Amide Hydrolase Fatty-acid amide hydrolase (FAAH) Fatty-acid amide hydrolase 1 (FAAH) Oleamide hydrolase 1
Type:
Single-pass membrane protein; homodimer
Mol. Mass.:
60474.00
Organism:
Rattus norvegicus (rat)
Description:
P97612 (aa 30-579)
Residue:
550
  
Inhibitor
Name:
BDBM50447653
Synonyms:
CHEMBL3112761
Type:
Small organic molecule
Emp. Form.:
C24H22Cl2N4O2
Mol. Mass.:
469.363
SMILES:
Clc1ccc(Oc2cccc(CN3CC4(C3)CN(C4)C(=O)Nc3cnccc3Cl)c2)cc1
: