Target
Beta-secretase 1
Ligand
BDBM50015545
Substrate
Meas. Tech.
ChEMBL_1348406 (CHEMBL3265959)
IC50
300±n/a nM
Citation
 Volgraf, MChan, LHuestis, MPPurkey, HEBurkard, MGeck Do, MHarris, JHunt, KWLiu, XLyssikatos, JPRana, SThomas, AAVigers, GPSiu, M Synthesis, characterization, and PK/PD studies of a series of spirocyclic pyranochromene BACE1 inhibitors. Bioorg Med Chem Lett 24:2477-80 (2014)  
Target
Name:
Beta-secretase 1
Synonyms:
ASP2 Aspartyl protease 2 BACE1 Beta-secretase (BACE) Beta-secretase 1 (BACE 1) Beta-secretase 1 (BACE1) Beta-site amyloid precursor protein cleaving enzyme 1 Memapsin-2 beta-Secretase (BACE-1) | beta-Secretase (BACE1)
Type:
Protein
Mol. Mass.:
55755.10
Organism:
Homo sapiens (Human)
Description:
P56817
Residue:
501
  
Inhibitor
Name:
BDBM50015545
Synonyms:
CHEMBL3265333
Type:
Small organic molecule
Emp. Form.:
C21H19N3O3
Mol. Mass.:
361.3939
SMILES:
[H][C@@]12COCC[C@@]1([H])[C@]1(COC(N)=N1)c1cc(ccc1O2)-c1cccc(c1)C#N
: