Target
Aurora kinase B
Ligand
BDBM50032627
Substrate
Meas. Tech.
ChEMBL_1440954 (CHEMBL3375804)
IC50
4030±n/a nM
Citation
 Hanan, EJEigenbrot, CBryan, MCBurdick, DJChan, BKChen, YDotson, JHeald, RAJackson, PSLa, HLainchbury, MDMalek, SPurkey, HESchaefer, GSchmidt, SSeward, EMSideris, STam, CWang, SYeap, SKYen, IYin, JYu, CZilberleyb, IHeffron, TP Discovery of selective and noncovalent diaminopyrimidine-based inhibitors of epidermal growth factor receptor containing the T790M resistance mutation. J Med Chem 57:10176-91 (2014)  
Target
Name:
Aurora kinase B
Synonyms:
AIK2 AIM1 ARK2 AURKB_HUMAN Aurora B-INCENP Aurora kinase B (AURKB) STK-1 STK12 Serine/threonine-protein kinase aurora B
Type:
Protein
Mol. Mass.:
39327.72
Organism:
Homo sapiens (Human)
Description:
Q96GD4
Residue:
344
  
Inhibitor
Name:
BDBM50032627
Synonyms:
CHEMBL3354189
Type:
Small organic molecule
Emp. Form.:
C22H28N6O
Mol. Mass.:
392.4973
SMILES:
COC1CCN(CC1)c1nccc(Nc2cc3n(ccc3cn2)C2CCCC2)n1
: