Target
Estrogen receptor
Ligand
BDBM50057651
Substrate
Meas. Tech.
ChEMBL_1448084 (CHEMBL3371989)
IC50
>1000±n/a nM
Citation
 Ullrich, TSasmal, SBoorgu, VPasagadi, SCheera, SRajagopalan, SBhumireddy, AShashikumar, DChelur, SBelliappa, CPandit, CKrishnamurthy, NMukherjee, SRamanathan, AGhadiyaram, CRamachandra, MSantos, PGLagu, BBock, MGPerrone, MHWeiler, SKeller, H 3-alkoxy-pyrrolo[1,2-b]pyrazolines as selective androgen receptor modulators with ideal physicochemical properties for transdermal administration. J Med Chem 57:7396-411 (2014)  
Target
Name:
Estrogen receptor
Synonyms:
ER ESR ESR1_HUMAN Estrogen receptor Estrogen receptor (ER-alpha) Estrogen receptor alpha (ER) Nuclear receptor subfamily 3 group A member 1
Type:
Protein
Mol. Mass.:
66230.44
Organism:
Homo sapiens (Human)
Description:
P03372
Residue:
595
  
Inhibitor
Name:
BDBM50057651
Synonyms:
CHEMBL3326454
Type:
Small organic molecule
Emp. Form.:
C15H16ClN3O2
Mol. Mass.:
305.759
SMILES:
[H][C@@]12[C@@H](O)CCN1N=C([C@H]2OC)c1ccc(C#N)c(Cl)c1C
: