Target
Monoglyceride lipase
Ligand
BDBM50065639
Substrate
Meas. Tech.
ChEMBL_1464519 (CHEMBL3405833)
IC50
155±n/a nM
Citation
 Patel, JZAhenkorah, SVaara, MStaszewski, MAdams, YLaitinen, TNavia-Paldanius, DParkkari, TSavinainen, JRWalczynski, KLaitinen, JTNevalainen, TJ Loratadine analogues as MAGL inhibitors. Bioorg Med Chem Lett 25:1436-42 (2015)  
Target
Name:
Monoglyceride lipase
Synonyms:
HU-K5 Lysophospholipase-like MGL MGLL_HUMAN
Type:
Hydrolase
Mol. Mass.:
33264.56
Organism:
Homo sapiens (Human)
Description:
Human recombinant MGL (Cayman Chemical, cat# 10008354).
Residue:
303
  
Inhibitor
Name:
BDBM50065639
Synonyms:
CHEMBL3402828
Type:
Small organic molecule
Emp. Form.:
C16H14N2O4
Mol. Mass.:
298.2934
SMILES:
CCOc1nn(-c2cccc(Oc3ccccc3)c2)c(=O)o1
: