Target
Monoglyceride lipase
Ligand
BDBM50065641
Substrate
Meas. Tech.
ChEMBL_1464454 (CHEMBL3405396)
IC50
208±n/a nM
Citation
 Patel, JZAhenkorah, SVaara, MStaszewski, MAdams, YLaitinen, TNavia-Paldanius, DParkkari, TSavinainen, JRWalczynski, KLaitinen, JTNevalainen, TJ Loratadine analogues as MAGL inhibitors. Bioorg Med Chem Lett 25:1436-42 (2015)  
Target
Name:
Monoglyceride lipase
Synonyms:
HU-K5 Lysophospholipase-like MGL MGLL_HUMAN
Type:
Hydrolase
Mol. Mass.:
33264.56
Organism:
Homo sapiens (Human)
Description:
Human recombinant MGL (Cayman Chemical, cat# 10008354).
Residue:
303
  
Inhibitor
Name:
BDBM50065641
Synonyms:
CHEMBL3401456
Type:
Small organic molecule
Emp. Form.:
C26H22ClN5O
Mol. Mass.:
455.939
SMILES:
Clc1ccc2c(-[#6]-[#6]-c3cccnc3\[#6]-2=[#6]-2\[#6]-[#6]-[#7](-[#6]-[#6]-2)-[#6](=O)-n2nnc3ccccc23)c1
: