Target
Monoglyceride lipase
Ligand
BDBM50065646
Substrate
Meas. Tech.
ChEMBL_1464454 (CHEMBL3405396)
IC50
0.360000±n/a nM
Citation
 Patel, JZAhenkorah, SVaara, MStaszewski, MAdams, YLaitinen, TNavia-Paldanius, DParkkari, TSavinainen, JRWalczynski, KLaitinen, JTNevalainen, TJ Loratadine analogues as MAGL inhibitors. Bioorg Med Chem Lett 25:1436-42 (2015)  
Target
Name:
Monoglyceride lipase
Synonyms:
HU-K5 Lysophospholipase-like MGL MGLL_HUMAN
Type:
Hydrolase
Mol. Mass.:
33264.56
Organism:
Homo sapiens (Human)
Description:
Human recombinant MGL (Cayman Chemical, cat# 10008354).
Residue:
303
  
Inhibitor
Name:
BDBM50065646
Synonyms:
CHEMBL3087181
Type:
Small organic molecule
Emp. Form.:
C23H22N4O5
Mol. Mass.:
434.4446
SMILES:
O=C(N1CCC(CC1)C(c1ccc2OCOc2c1)c1ccc2OCOc2c1)n1cncn1
: