Target
Fatty-acid amide hydrolase 1
Ligand
BDBM50065640
Substrate
Meas. Tech.
ChEMBL_1464456 (CHEMBL3405398)
IC50
7240±n/a nM
Citation
 Patel, JZAhenkorah, SVaara, MStaszewski, MAdams, YLaitinen, TNavia-Paldanius, DParkkari, TSavinainen, JRWalczynski, KLaitinen, JTNevalainen, TJ Loratadine analogues as MAGL inhibitors. Bioorg Med Chem Lett 25:1436-42 (2015)  
Target
Name:
Fatty-acid amide hydrolase 1
Synonyms:
Anandamide amidohydrolase FAAH FAAH1_HUMAN Fatty-acid amide hydrolase (FAAH) Oleamide hydrolase 1
Type:
Protein
Mol. Mass.:
63071.19
Organism:
Homo sapiens (Human)
Description:
O00519
Residue:
579
  
Inhibitor
Name:
BDBM50065640
Synonyms:
CHEMBL3401455
Type:
Small organic molecule
Emp. Form.:
C22H20ClN5O
Mol. Mass.:
405.88
SMILES:
Clc1ccc2c(-[#6]-[#6]-c3cccnc3\[#6]-2=[#6]-2\[#6]-[#6]-[#7](-[#6]-[#6]-2)-[#6](=O)-n2cncn2)c1
: