Target
Monoglyceride lipase
Ligand
BDBM50132713
Substrate
Meas. Tech.
ChEMBL_1464518 (CHEMBL3405832)
IC50
25±n/a nM
Citation
 Patel, JZAhenkorah, SVaara, MStaszewski, MAdams, YLaitinen, TNavia-Paldanius, DParkkari, TSavinainen, JRWalczynski, KLaitinen, JTNevalainen, TJ Loratadine analogues as MAGL inhibitors. Bioorg Med Chem Lett 25:1436-42 (2015)  
Target
Name:
Monoglyceride lipase
Synonyms:
HU-K5 Lysophospholipase-like MGL MGLL_HUMAN
Type:
Hydrolase
Mol. Mass.:
33264.56
Organism:
Homo sapiens (Human)
Description:
Human recombinant MGL (Cayman Chemical, cat# 10008354).
Residue:
303
  
Inhibitor
Name:
BDBM50132713
Synonyms:
Arachidonic acid derivative Methyl arachidonoyl fluorophophonate methyl (5Z,8Z,11Z,14Z)-icosa-5,8,11,14-tetraenylphosphonofluoridate methyl(5Z,8Z,11Z,14Z)-icosa-5,8,11,14-tetraenylphosphonofluoridate | methylarachidonyl fluorophosphonate
Type:
Small organic molecule
Emp. Form.:
C21H36FO2P
Mol. Mass.:
370.4815
SMILES:
CCCCC\C=C/C\C=C/C\C=C/C\C=C/CCCCP(F)(=O)OC
: