Target
17-beta-hydroxysteroid dehydrogenase type 1
Ligand
BDBM50078673
Substrate
Meas. Tech.
ChEMBL_1471515 (CHEMBL3420078)
IC50
1400±n/a nM
Citation
 Maltais, RTrottier, ADelhomme, ABarbeau, XLagüe, PPoirier, D Identification of fused 16ß,17ß-oxazinone-estradiol derivatives as a new family of non-estrogenic 17ß-hydroxysteroid dehydrogenase type 1 inhibitors. Eur J Med Chem 93:470-80 (2015)  
Target
Name:
17-beta-hydroxysteroid dehydrogenase type 1
Synonyms:
17-beta-HSD 1 17-beta-hydroxysteroid dehydrogenase type 1 20-alpha-HSD E17KSR EDH17B1 EDHB17 Estradiol 17-beta-dehydrogenase 1 (17beta-HSD1) Placental 17-beta-hydroxysteroid dehydrogenase | SDR28C1
Type:
Enzyme
Mol. Mass.:
34945.13
Organism:
Homo sapiens (Human)
Description:
P14061
Residue:
328
  
Inhibitor
Name:
BDBM50078673
Synonyms:
CHEMBL3415436
Type:
Small organic molecule
Emp. Form.:
C31H36N2O4
Mol. Mass.:
500.6285
SMILES:
[H][C@]12OC(=O)N(CCCC)[C@H](C1=C[C@@]1([H])[C@]3([H])CCc4cc(O)ccc4[C@@]3([H])CC[C@]21C)c1cccc(c1)C(N)=O
: