Target
Glucocorticoid receptor
Ligand
BDBM50081075
Substrate
Meas. Tech.
ChEMBL_1475545 (CHEMBL3424571)
IC50
2.5±n/a nM
Citation
 Chantigny, YAMurray, JCKleinman, EFRobinson, RPPlotkin, MAReese, MRBuckbinder, LMcNiff, PAMillham, MLSchaefer, JFAbramov, YABordner, J 2-Aryl-3-methyloctahydrophenanthrene-2,3,7-triols as potent dissociated glucocorticoid receptor agonists. J Med Chem 58:2658-77 (2015)  
Target
Name:
Glucocorticoid receptor
Synonyms:
GCR_HUMAN GRL Glucocorticoid receptor (GRFP) Nuclear receptor subfamily 3 group C member 1
Type:
Enzyme
Mol. Mass.:
85656.87
Organism:
Homo sapiens (Human)
Description:
P04150
Residue:
777
  
Inhibitor
Name:
BDBM50081075
Synonyms:
CHEMBL3421887
Type:
Small organic molecule
Emp. Form.:
C23H26O4
Mol. Mass.:
366.4501
SMILES:
[H][C@]12CC(=O)c3cc(O)ccc3[C@]1(CC)C[C@@](C)(O)[C@@](O)(C2)c1ccccc1
: