Target
Glucocorticoid receptor
Ligand
BDBM50081063
Substrate
Meas. Tech.
ChEMBL_1475545 (CHEMBL3424571)
IC50
1.3±n/a nM
Citation
 Chantigny, YAMurray, JCKleinman, EFRobinson, RPPlotkin, MAReese, MRBuckbinder, LMcNiff, PAMillham, MLSchaefer, JFAbramov, YABordner, J 2-Aryl-3-methyloctahydrophenanthrene-2,3,7-triols as potent dissociated glucocorticoid receptor agonists. J Med Chem 58:2658-77 (2015)  
Target
Name:
Glucocorticoid receptor
Synonyms:
GCR_HUMAN GRL Glucocorticoid receptor (GRFP) Nuclear receptor subfamily 3 group C member 1
Type:
Enzyme
Mol. Mass.:
85656.87
Organism:
Homo sapiens (Human)
Description:
P04150
Residue:
777
  
Inhibitor
Name:
BDBM50081063
Synonyms:
CHEMBL3421875
Type:
Small organic molecule
Emp. Form.:
C24H30O3
Mol. Mass.:
366.4932
SMILES:
[H][C@]12CCc3cc(O)ccc3[C@]1(CC)C[C@@](C)(O)[C@@](O)(C2)c1ccc(C)cc1
: