Target
Nuclear receptor ROR-gamma
Ligand
BDBM50108884
Substrate
Meas. Tech.
ChEMBL_1506713 (CHEMBL3598804)
IC50
100±n/a nM
Citation
 Chao, JEnyedy, IVan Vloten, KMarcotte, DGuertin, KHutchings, RPowell, NJones, HBohnert, TPeng, CCSilvian, LHong, VSLittle, KBanerjee, DPeng, LTaveras, AViney, JLFontenot, J Discovery of biaryl carboxylamides as potent ROR¿ inverse agonists. Bioorg Med Chem Lett 25:2991-7 (2015)  
Target
Name:
Nuclear receptor ROR-gamma
Synonyms:
NR1F3 Nuclear receptor ROR-gamma (RORC) RAR-related orphan receptor C (RORc) RORG RZRG Retinoid-related orphan receptor-gamma (RORc)
Type:
Enzyme Catalytic Domain
Mol. Mass.:
58218.40
Organism:
Homo sapiens (Human)
Description:
P51449
Residue:
518
  
Inhibitor
Name:
BDBM50108884
Synonyms:
CHEMBL3596600
Type:
Small organic molecule
Emp. Form.:
C24H19Cl2FN2O2
Mol. Mass.:
457.324
SMILES:
CNC(=O)c1ccc(Cl)c(c1)-c1ccc2N(CCCc2c1)C(=O)c1c(F)cccc1Cl
: