Target
C-X-C chemokine receptor type 2
Ligand
BDBM50115217
Substrate
Meas. Tech.
ChEMBL_1513746 (CHEMBL3610856)
IC50
1100±n/a nM
Citation
 Schuler, ADEngles, CAMaeda, DYQuinn, MTKirpotina, LNWicomb, WNMason, SNAuten, RLZebala, JA Boronic acid-containing aminopyridine- and aminopyrimidinecarboxamide CXCR1/2 antagonists: Optimization of aqueous solubility and oral bioavailability. Bioorg Med Chem Lett 25:3793-7 (2015)  
Target
Name:
C-X-C chemokine receptor type 2
Synonyms:
C-X-C chemokine receptor type 2 (CXCR-2) CD_antigen=CD182 CXCR-2 CXCR2_HUMAN GRO/MGSA receptor IL-8 receptor type 2 IL8RB | Interleukin-8 receptor B
Type:
Protein
Mol. Mass.:
40767.88
Organism:
Homo sapiens (Human)
Description:
P25025
Residue:
360
  
Inhibitor
Name:
BDBM50115217
Synonyms:
CHEMBL3609005 USRE48547, Compound 18
Type:
Small organic molecule
Emp. Form.:
C20H19BFN3O3
Mol. Mass.:
379.193
SMILES:
CN(Cc1ccc(cc1)B(O)O)c1ccc(cn1)C(=O)Nc1ccc(F)cc1
: