Target
C-X-C chemokine receptor type 1
Ligand
BDBM50115217
Substrate
Meas. Tech.
ChEMBL_1513745 (CHEMBL3610855)
IC50
1400±n/a nM
Citation
 Schuler, ADEngles, CAMaeda, DYQuinn, MTKirpotina, LNWicomb, WNMason, SNAuten, RLZebala, JA Boronic acid-containing aminopyridine- and aminopyrimidinecarboxamide CXCR1/2 antagonists: Optimization of aqueous solubility and oral bioavailability. Bioorg Med Chem Lett 25:3793-7 (2015)  
Target
Name:
C-X-C chemokine receptor type 1
Synonyms:
C-X-C chemokine receptor type 1 (CXCR-1) CMKAR1 CXCR1_HUMAN Interleukin-8 receptor A | Interleukin-8 receptors, CXCR1/CXCR2
Type:
Enzyme
Mol. Mass.:
39803.83
Organism:
Homo sapiens (Human)
Description:
P25024
Residue:
350
  
Inhibitor
Name:
BDBM50115217
Synonyms:
CHEMBL3609005 USRE48547, Compound 18
Type:
Small organic molecule
Emp. Form.:
C20H19BFN3O3
Mol. Mass.:
379.193
SMILES:
CN(Cc1ccc(cc1)B(O)O)c1ccc(cn1)C(=O)Nc1ccc(F)cc1
: