Target
Receptor-interacting serine/threonine-protein kinase 2
Ligand
BDBM50128687
Substrate
Meas. Tech.
ChEMBL_1522561 (CHEMBL3631914)
IC50
500±n/a nM
Citation
 Charnley, AKConvery, MALakdawala Shah, AJones, EHardwicke, PBridges, AOuellette, MTotoritis, RSchwartz, BKing, BWWisnoski, DDKang, JEidam, PMVotta, BJGough, PJMarquis, RWBertin, JCasillas, L Crystal structures of human RIP2 kinase catalytic domain complexed with ATP-competitive inhibitors: Foundations for understanding inhibitor selectivity. Bioorg Med Chem 23:7000-6 (2015)  
Target
Name:
Receptor-interacting serine/threonine-protein kinase 2
Synonyms:
CARDIAK RIP2 RIPK2_HUMAN Tyrosine-protein kinase RIPK2 | receptor-interacting serine/threonine-protein kinase 2
Type:
Protein
Mol. Mass.:
61201.30
Organism:
Homo sapiens (Human)
Description:
Residue:
540
  
Inhibitor
Name:
BDBM50128687
Synonyms:
CHEMBL3628628
Type:
Small organic molecule
Emp. Form.:
C23H24ClN5O3
Mol. Mass.:
453.921
SMILES:
COCCNC(=O)c1ccc2n(CCOC)c(nc2c1)-c1cnc([nH]1)-c1ccc(Cl)cc1
: