Target
Cytochrome P450 1A2
Ligand
BDBM50236897
Substrate
Meas. Tech.
ChEMBL_1525504 (CHEMBL3636857)
IC50
300±n/a nM
Citation
 Elkamhawy, AViswanath, ANPae, ANKim, HYHeo, JCPark, WKLee, COYang, HKim, KHNam, DHSeol, HJCho, HRoh, EJ Discovery of potent and selective cytotoxic activity of new quinazoline-ureas against TMZ-resistant glioblastoma multiforme (GBM). Eur J Med Chem 103:210-22 (2015)  
Target
Name:
Cytochrome P450 1A2
Synonyms:
CP1A2_HUMAN CYPIA2 Cytochrome P(3)450 Cytochrome P450 1A2 (CYP1A2) Cytochrome P450-P3
Type:
Enzyme
Mol. Mass.:
58423.38
Organism:
Homo sapiens (Human)
Description:
P05177
Residue:
516
  
Inhibitor
Name:
BDBM50236897
Synonyms:
3-(furan-2-ylmethyl)-1,8-dimethyl-1H-purine-2,6(3H,7H)-dione US9180183, Furafylline | furafylline
Type:
Small organic molecule
Emp. Form.:
C12H12N4O3
Mol. Mass.:
260.2487
SMILES:
Cc1nc2n(Cc3ccco3)c(=O)n(C)c(=O)c2[nH]1
: