Target
Synaptic vesicular amine transporter
Ligand
BDBM50080827
Substrate
Meas. Tech.
ChEBML_1571954
Ki
67±n/a nM
Citation
 Joolakanti, SRNickell, JRJanganati, VZheng, GDwoskin, LPCrooks, PA Lobelane analogues containing 4-hydroxy and 4-(2-fluoroethoxy) aromatic substituents: Potent and selective inhibitors of [(3)H]dopamine uptake at the vesicular monoamine transporter-2. Bioorg Med Chem Lett 26:2422-7 (2016)  
Target
Name:
Synaptic vesicular amine transporter
Synonyms:
Monoamine transporter Solute carrier family 18 member 2 Synaptic vesicular amine transporter VMAT2_RAT Vesicular monoamine transporter 2 (VMAT2) | Vmat2
Type:
Protein
Mol. Mass.:
55689.58
Organism:
Rattus norvegicus (Rat)
Description:
Q01827
Residue:
515
  
Inhibitor
Name:
BDBM50080827
Synonyms:
(2R,6S)-1-Methyl-2,6-diphenethyl-piperidine CHEMBL1085811 Lobelane | cis-N-methyl-2,6-diphenethylpiperidine
Type:
Small organic molecule
Emp. Form.:
C22H29N
Mol. Mass.:
307.4724
SMILES:
CN1[C@@H](CCc2ccccc2)CCC[C@H]1CCc1ccccc1
: