Target
Synaptic vesicular amine transporter
Ligand
BDBM50433783
Substrate
Meas. Tech.
ChEBML_1571954
Ki
29±n/a nM
Citation
 Joolakanti, SRNickell, JRJanganati, VZheng, GDwoskin, LPCrooks, PA Lobelane analogues containing 4-hydroxy and 4-(2-fluoroethoxy) aromatic substituents: Potent and selective inhibitors of [(3)H]dopamine uptake at the vesicular monoamine transporter-2. Bioorg Med Chem Lett 26:2422-7 (2016)  
Target
Name:
Synaptic vesicular amine transporter
Synonyms:
Monoamine transporter Solute carrier family 18 member 2 Synaptic vesicular amine transporter VMAT2_RAT Vesicular monoamine transporter 2 (VMAT2) | Vmat2
Type:
Protein
Mol. Mass.:
55689.58
Organism:
Rattus norvegicus (Rat)
Description:
Q01827
Residue:
515
  
Inhibitor
Name:
BDBM50433783
Synonyms:
CHEMBL2381721
Type:
Small organic molecule
Emp. Form.:
C26H37NO4
Mol. Mass.:
427.5763
SMILES:
COc1ccc(CC[C@H]2CCC[C@@H](CCc3ccc(OC)cc3)N2C[C@@H](O)CO)cc1
: