Target
Synaptic vesicular amine transporter
Ligand
BDBM50161097
Substrate
Meas. Tech.
ChEMBL_1571954 (CHEMBL3796412)
Ki
63±n/a nM
Citation
 Joolakanti, SRNickell, JRJanganati, VZheng, GDwoskin, LPCrooks, PA Lobelane analogues containing 4-hydroxy and 4-(2-fluoroethoxy) aromatic substituents: Potent and selective inhibitors of [(3)H]dopamine uptake at the vesicular monoamine transporter-2. Bioorg Med Chem Lett 26:2422-7 (2016)  
Target
Name:
Synaptic vesicular amine transporter
Synonyms:
Monoamine transporter Solute carrier family 18 member 2 Synaptic vesicular amine transporter VMAT2_RAT Vesicular monoamine transporter 2 (VMAT2) | Vmat2
Type:
Protein
Mol. Mass.:
55689.58
Organism:
Rattus norvegicus (Rat)
Description:
Q01827
Residue:
515
  
Inhibitor
Name:
BDBM50161097
Synonyms:
CHEMBL3793787
Type:
Small organic molecule
Emp. Form.:
C26H37ClFNO4
Mol. Mass.:
482.028
SMILES:
Cl.OC[C@H](O)CN1[C@@H](CCc2ccc(O)cc2)CCC[C@H]1CCc1ccc(OCCF)cc1
: