Target
Sodium-dependent dopamine transporter
Ligand
BDBM50433783
Substrate
Meas. Tech.
ChEMBL_1571955 (CHEMBL3796413)
Ki
1440±n/a nM
Citation
 Joolakanti, SRNickell, JRJanganati, VZheng, GDwoskin, LPCrooks, PA Lobelane analogues containing 4-hydroxy and 4-(2-fluoroethoxy) aromatic substituents: Potent and selective inhibitors of [(3)H]dopamine uptake at the vesicular monoamine transporter-2. Bioorg Med Chem Lett 26:2422-7 (2016)  
Target
Name:
Sodium-dependent dopamine transporter
Synonyms:
DA transporter SC6A3_RAT Sodium-dependent dopamine transporter | Sodium-dependent dopamine transporter (DAT)
Type:
Multi-pass membrane protein
Mol. Mass.:
68749.45
Organism:
Rattus norvegicus (rat)
Description:
P23977
Residue:
619
  
Inhibitor
Name:
BDBM50433783
Synonyms:
CHEMBL2381721
Type:
Small organic molecule
Emp. Form.:
C26H37NO4
Mol. Mass.:
427.5763
SMILES:
COc1ccc(CC[C@H]2CCC[C@@H](CCc3ccc(OC)cc3)N2C[C@@H](O)CO)cc1
: